21H,23H-Porphine-2,7,12,17-tetrapropanoic acid, 3,8,13,18-tetramethyl-, tetramethyl ester

Condensed phase thermochemistry data

Data compiled by: Hussein Y. Afeefy, Joel F. Liebman, and Stephen E. Stein

Quantity Value Units Method Reference Comment
Δcsolid-20834. ± 21.kJ/molCcbStern and Klebs, 1933Reanalyzed by Cox and Pilcher, 1970, Original value = -20868. kJ/mol; Heat of combustion at 288 K

References

Stern and Klebs, 1933
Stern, A.; Klebs, G., Calorimetrische bestimmungen bei mehrkernigen pyrrolderivaten. IV. 1. Experimentelle daten fur einige porphyrine, chlorine, phaophorbide and purpurine, Ann. Chim., 1933, 505, 295-306. [all data]

Cox and Pilcher, 1970
Cox, J.D.; Pilcher, G., Thermochemistry of Organic and Organometallic Compounds, Academic Press, New York, 1970, 1-636. [all data]