2,4,6-Trimethoxybenzonitrile

Phase change data

Data compiled as indicated in comments:
ALS - Hussein Y. Afeefy, Joel F. Liebman, and Stephen E. Stein
AC - William E. Acree, Jr., James S. Chickos

Quantity Value Units Method Reference Comment
Δsub112.6 ± 2.0kJ/molVAcree, Tucker, et al., 1991ALS
Δsub112.6 ± 2.0kJ/molCAcree, Tucker, et al., 1991AC

Gas phase thermochemistry data

Data compiled by: Hussein Y. Afeefy, Joel F. Liebman, and Stephen E. Stein

Quantity Value Units Method Reference Comment
Δfgas-244.6 ± 2.6kJ/molCcbAcree, Tucker, et al., 1991

Condensed phase thermochemistry data

Data compiled by: Hussein Y. Afeefy, Joel F. Liebman, and Stephen E. Stein

Quantity Value Units Method Reference Comment
Δfsolid-85.37 ± 0.38kcal/molCcbAcree, Tucker, et al., 1991
Quantity Value Units Method Reference Comment
Δcsolid-1230.9 ± 0.2kcal/molCcbAcree, Tucker, et al., 1991

References

Acree, Tucker, et al., 1991
Acree, W.E., Jr.; Tucker, S.A.; Zvaigzne, A.I.; Meng-Yan, Y.; Pilcher, G.; Ribeiro Da Silva, M.D.M., Enthalpies of combustion of 2,4,6-trimethylbenzonitrile, 2,4,6-trimethylbenzonitrile N-oxide,, 2,6-dimethylbenzonitrile, 2,4,6-trimethoxybenzonitrile, and 2,4,6-trimethoxybenzonitrile N-oxide: the dissociation enthalpies of the (N-O) bonds, J. Chem. Thermodyn., 1991, 23, 31-36. [all data]