1-cyclohexene-1-carboxylic acid, 2-methoxy-, methyl ester

Phase change data

Data compiled by: Thermodynamics Research Center, NIST Boulder Laboratories, Chris Muzny director

Quantity Value Units Method Reference Comment
Tfus318.9KN/ARhoads, Chattopadhyay, et al., 1970Uncertainty assigned by TRC = 2. K

In addition to the Thermodynamics Research Center (TRC) data available from this site, much more physical and chemical property data is available from the following TRC products:

References

Rhoads, Chattopadhyay, et al., 1970
Rhoads, S.J.; Chattopadhyay, J.K.; Waali, E.E., Double-Bond Isomerization in Unsaturated Esters and Enol Ethers I. Equilibrium Studiies in Cyclic and Acyclclic Systems, J. Org. Chem., 1970, 35, 3352-8. [all data]