(R)-2,8-Dimethyl-2-((3E,7E)-4,8,12-trimethyltrideca-3,7,11-trien-1-yl)chroman-6-ol

Van Den Dool and Kratz RI, non-polar column, custom temperature program

View large format table.

Column type Active phase I Reference Comment
CapillaryHP-5MS3072.7Andriamaharavo, 201430. m/0.25 mm/0.25 μm, He; Program: 60C (1 min) => 5 C/min => 210C => 10 C/min => 280C (15 min)

Normal alkane RI, non-polar column, isothermal

View large format table.

Column type Active phase Temperature (C) I Reference Comment
PackedSE-30235.2985.Slover, Shelley, et al., 1967He, Anakrom; Column length: 4.6 m

References

Andriamaharavo, 2014
Andriamaharavo, N.R., Retention Data. NIST Mass Spectrometry Data Center., NIST Mass Spectrometry Data Center, 2014. [all data]

Slover, Shelley, et al., 1967
Slover, H.T.; Shelley, L.M.; Burks, T.L., Identification and estimation of tocopherols by gas-liquid chromatography, J. Amer. Oil Chem. Soc., 1967, 44, 3, 161-166, https://doi.org/10.1007/BF02545257 . [all data]