cis-4a-Methyl-decahydronaphthalene

Condensed phase thermochemistry data

Data compiled by: Hussein Y. Afeefy, Joel F. Liebman, and Stephen E. Stein

Quantity Value Units Method Reference Comment
Δfliquid-244.0 ± 2.0kJ/molCcbDauben and Rohr, 1960
Quantity Value Units Method Reference Comment
Δcliquid-6943.1 ± 1.9kJ/molCcbDauben and Rohr, 1960Corresponding Δfliquid = -243.8 kJ/mol (simple calculation by NIST; no Washburn corrections)

Reaction thermochemistry data

Data compiled by: Hussein Y. Afeefy, Joel F. Liebman, and Stephen E. Stein

Individual Reactions

cis-4a-Methyl-decahydronaphthalene = trans-4a-Methyl-decahydronaphthalene

By formula: C11H20 = C11H20

Quantity Value Units Method Reference Comment
Δr-0.55 ± 0.28kcal/molEqkAllinger and Coke, 1961liquid phase; At 584 K

References

Dauben and Rohr, 1960
Dauben, W.G.; Rohr, O., The heat of isomerization of the cis and trans isomers of 9-methyldecahydronaphthalene, J. Phys. Chem., 1960, 64, 283-284. [all data]