Neodymium dichloride

Reaction thermochemistry data

Data compiled by: John E. Bartmess

Individual Reactions

Chlorine anion + Cl2Nd = (Chlorine anion • Cl2Nd)

By formula: Cl- + Cl2Nd = (Cl- • Cl2Nd)

Quantity Value Units Method Reference Comment
Δr274. ± 15.kJ/molTDAsKudin, Pogrebnoi, et al., 1993gas phase; value altered from reference due to conversion from electron convention to ion convention

Cl3Nd- + Cl2Nd = Cl5Nd2-

By formula: Cl3Nd- + Cl2Nd = Cl5Nd2-

Quantity Value Units Method Reference Comment
Δr369. ± 22.kJ/molTDAsKudin, Pogrebnoi, et al., 1993gas phase; value altered from reference due to conversion from electron convention to ion convention

References

Kudin, Pogrebnoi, et al., 1993
Kudin, L.S.; Pogrebnoi, A.M.; Burdukovskaya, G.G., Mass-Spectrometric Study of Saturated Vapor Composition over Neodymium Chlorides .2. Ion-Molecular Equilibrium and Enthalpies of Formation of Formation of Positive and Negative Ions., Zh. Fiz. Khim. SSSR, 1993, 67, 908. [all data]