Anthranilic acid, TMS derivative

Van Den Dool and Kratz RI, non-polar column, custom temperature program

View large format table.

Column type Active phase I Reference Comment
CapillaryPolydimethyl siloxane with 5 % phenyl groups1511.Kempa, Hummel, et al., 2009Program: not specified
CapillaryVF-5MS1495.1Tret'yakov, 200730. m/0.25 mm/0.25 μm, He; Program: Multi-step temperature program; T(initial)=60C; T(final)=270C

References

Kempa, Hummel, et al., 2009
Kempa, S.; Hummel, J.; Schwemmer, T.; Pietzke, M.; Strehmel, N.; Wienkoop, S.; Kopka, J.; Weckwerth, W., An automated GCxGC-TOF-MS protocol for batch-wise extraction and alinmebt of mass isotopomer matrixes from differential 13C-labeling experiments: a case study for photoautotrophic-mixotrophic grown Chlamydomonas reinhardtii cells, J. Basic Microbiol., 2009, 49, 1, 82-91, https://doi.org/10.1002/jobm.200800337 . [all data]

Tret'yakov, 2007
Tret'yakov, K.V., Retention Data. NIST Mass Spectrometry Data Center., NIST Mass Spectrometry Data Center, 2007. [all data]