1-Pentanamine, N-methyl-

Kovats' RI, non-polar column, isothermal

View large format table.

Column type Active phase Temperature (C) I Reference Comment
PackedOV-101130.706.Osmialowski, Halkiewicz, et al., 1985Ar, Chromosorb W HP; Column length: 1. m

Normal alkane RI, non-polar column, isothermal

View large format table.

Column type Active phase Temperature (C) I Reference Comment
CapillaryOV-101130.706.Qi, Yang, et al., 2000

Phase change data

Data compiled by: Thermodynamics Research Center, NIST Boulder Laboratories, Chris Muzny director

Quantity Value Units Method Reference Comment
Tboil390.15KN/ALoffler, 1910Uncertainty assigned by TRC = 3. K

In addition to the Thermodynamics Research Center (TRC) data available from this site, much more physical and chemical property data is available from the following TRC products:

References

Osmialowski, Halkiewicz, et al., 1985
Osmialowski, K.; Halkiewicz, J.; Radecki, A.; Kaliszan, R., Quantum chemical parameters in correlation analysis of gas-liquid chromatographic retention indices of amines, J. Chromatogr., 1985, 346, 53-60, https://doi.org/10.1016/S0021-9673(00)90493-X . [all data]

Qi, Yang, et al., 2000
Qi, Y.; Yang, J.; Xu, L., correlation analysis of the structures and gas liquid chromatographic retention indices of amines, Chin. J. Anal. Chem., 2000, 28, 2, 223-227. [all data]