3-methylbutyl crotonate

Phase change data

Data compiled as indicated in comments:
ALS - Hussein Y. Afeefy, Joel F. Liebman, and Stephen E. Stein
DRB - Donald R. Burgess, Jr.

Quantity Value Units Method Reference Comment
Δvap54. ± 1.kJ/molESchjanberg, 1936Heat of formation derived by Cox and Pilcher, 1970; ALS
Δvap54.0kJ/molN/ASchjanberg, 1936DRB

References

Schjanberg, 1936
Schjanberg, E., Die verbrennungswarmen und die refraktionsdaten einiger crotonsaureeste, Z. Phys. Chem., 1936, 175, 289-342. [all data]

Cox and Pilcher, 1970
Cox, J.D.; Pilcher, G., Thermochemistry of Organic and Organometallic Compounds, Academic Press, New York, 1970, 1-636. [all data]