Methyldinitramine

Condensed phase thermochemistry data

Data compiled by: Hussein Y. Afeefy, Joel F. Liebman, and Stephen E. Stein

Quantity Value Units Method Reference Comment
Δfliquid1.7 ± 0.8kJ/molEqkKorsunskii, Sitonina, et al., 1989see 87 MIR/KOR
Quantity Value Units Method Reference Comment
Δfsolid1.5 ± 0.7kJ/molCcrMiroshnichenko, Korchatova, et al., 1987
Quantity Value Units Method Reference Comment
Δcsolid-823.8 ± 0.7kJ/molCcrMiroshnichenko, Korchatova, et al., 1987

References

Korsunskii, Sitonina, et al., 1989
Korsunskii, B.L.; Sitonina, G.V.; Fedorov, B.S.; Dubovitskii, F.I.; Eremenko, L.T., Kinetics of the thermal decomposition of N,N-(Dinitro)alkylamines, Bull. Acad. Sci. USSR, Div. Chem. Sci., 1989, 710-713. [all data]

Miroshnichenko, Korchatova, et al., 1987
Miroshnichenko, E.A.; Korchatova, L.I.; Korsunskii, B.L.; Fedorov, B.S.; Orlov, Yu.D.; Eremenko, L.T.; Lebedev, Yu.A.; Dubovitskii, F.I., Thermochemistry of methyldinitramine and the enthalpy of formation of the methylnitramine radical, Dokl. Akad. Nauk SSSR, 1987, 295, 419-423. [all data]