Phosphoric acid, dibutyl phenyl ester

Kovats' RI, non-polar column, isothermal

View large format table.

Column type Active phase Temperature (C) I Reference Comment
CapillaryOV-101200.1889.Gandhe, Purnanand, et al., 1990N2; Column length: 30. m; Column diameter: 0.32 mm

Kovats' RI, polar column, isothermal

View large format table.

Column type Active phase Temperature (C) I Reference Comment
CapillaryDB-Wax200.2596.Gandhe, Purnanand, et al., 1990N2; Column length: 30. m; Column diameter: 0.32 mm

References

Gandhe, Purnanand, et al., 1990
Gandhe, B.R.; Purnanand; Prasad, R.; Danikhel, R.K.; Shinde, S.K.; Srivastava, R.K.; Batra, B.S.; Rao, K.M., Use of gas chromatographic retention indices for quantitative structure activity relationship studies of dialkyl phenyl phosphates, Pestic. Sci., 1990, 29, 4, 379-385, https://doi.org/10.1002/ps.2780290402 . [all data]