Heneicosane, 5-methyl-

Kovats' RI, non-polar column, isothermal

View large format table.

Column type Active phase Temperature (C) I Reference Comment
CapillaryOV-101190.2152.Kusmierz, Malinski, et al., 1985Column length: 22. m; Column diameter: 0.3 mm
CapillaryApiezon L190.2146.4Kusmierz, Malinski, et al., 1985He; Column length: 20. m; Column diameter: 0.3 mm
CapillarySE-52190.2151.1Kusmierz, Malinski, et al., 1985He; Column length: 40. m; Column diameter: 0.3 mm

Kovats' RI, polar column, isothermal

View large format table.

Column type Active phase Temperature (C) I Reference Comment
CapillaryCarbowax 20M150.2148.5Kusmierz, Malinski, et al., 1985He; Column length: 30. m; Column diameter: 0.25 mm

Van Den Dool and Kratz RI, non-polar column, temperature ramp

View large format table.

Column type Active phase I Reference Comment
CapillaryCross-Linked Methylsilicone2153.Khorasheh, Gray, et al., 19895. K/min; Tstart: 40. C; Tend: 300. C

Van Den Dool and Kratz RI, non-polar column, custom temperature program

View large format table.

Column type Active phase I Reference Comment
CapillaryDB-52151.Zaikin and Borisov, 2002He; Column length: 30. m; Column diameter: 0.25 mm; Program: 30C => 5K/min=120C => 10C/min => 270C

Normal alkane RI, non-polar column, temperature ramp

View large format table.

Column type Active phase I Reference Comment
CapillaryDB-12151.Steiger, Haberer, et al., 201130. m/0.25 mm/0.25 μm, Helium, 10. K/min; Tstart: 50. C; Tend: 250. C
CapillaryOV-12153.2Krkosova, Kubinec, et al., 2007100. m/0.32 mm/0.25 μm, Helium, 5. K/min, 310. C @ 5. min; Tstart: 30. C

Normal alkane RI, non-polar column, custom temperature program

View large format table.

Column type Active phase I Reference Comment
Capillary 2151.Steiger, Peschke, et al., 2007Program: not specified

Phase change data

Data compiled by: William E. Acree, Jr., James S. Chickos

Enthalpy of vaporization

ΔvapH (kJ/mol) Temperature (K) Method Reference Comment
73.9498.AStephenson and Malanowski, 1987Based on data from 483. - 632. K. See also Dykyj, Svoboda, et al., 1999.

References

Kusmierz, Malinski, et al., 1985
Kusmierz, J.; Malinski, E.; Czerwiec, W.; Szafranek, J., Kováts retention indices of high-molecular-weight monomethyl-, cyclopentyl-, cyclohexyl- and phenylalkanes, J. Chromatogr., 1985, 331, 219-228, https://doi.org/10.1016/0021-9673(85)80027-3 . [all data]

Khorasheh, Gray, et al., 1989
Khorasheh, F.; Gray, M.R.; Selucky, M.L., Correlation for Kováts retention index of C9-C26 monoalkyl and polymethyl alkanes and alkenes, J. Chromatogr., 1989, 481, 1-16, https://doi.org/10.1016/S0021-9673(01)96747-0 . [all data]

Zaikin and Borisov, 2002
Zaikin, V.G.; Borisov, R.S., Chromatographic-mass spectrometric analysis of Fishcer-Tropsch synthesis products, J. Anal. Chem. USSR (Engl. Transl.), 2002, 57, 6, 544-551. [all data]

Steiger, Haberer, et al., 2011
Steiger, S.; Haberer, W.; Muller, J.K., Social environment determines degree of chemical signalling (Supplemented matherials), Biol. Lett., 2011, 7, 6, 822-824, https://doi.org/10.1098/rsbl.2011.0457 . [all data]

Krkosova, Kubinec, et al., 2007
Krkosova, Z.; Kubinec, R.; Addova, G.; Jurdakova, H.; Blasko, J.; Ostrovsky, I.; Sojak, L., Gas chromatographic - mass spectrometric characterization of monomethylalkanes from fuel diesel, Petroleum Coal, 2007, 49, 3, 51-62. [all data]

Steiger, Peschke, et al., 2007
Steiger, S.; Peschke, K.; Francke, W.; Muller, J.K., The smell of parents: breeding status influences cuticular hydrocarbon pattern in the burying beetle Nicrophorus vespilloides, Proc. Roy. Soc. B, 2007, 274, 1622, 2211-2220, https://doi.org/10.1098/rspb.2007.0656 . [all data]