Tetradecane, 5-methyl-

Kovats' RI, non-polar column, isothermal

View large format table.

Column type Active phase Temperature (C) I Reference Comment
CapillaryApiezon L100.1444.Rappoport and Gäumann, 1973

Van Den Dool and Kratz RI, non-polar column, temperature ramp

View large format table.

Column type Active phase I Reference Comment
CapillaryCross-Linked Methylsilicone1454.Khorasheh, Gray, et al., 19895. K/min; Tstart: 40. C; Tend: 300. C
CapillaryUltra-11454.18Haynes and Pitzer, 198550. m/0.22 mm/0.33 μm, He, 1. K/min; Tstart: -30. C; Tend: 240. C
CapillaryUltra-11454.31Haynes and Pitzer, 198550. m/0.22 mm/0.33 μm, He, 2. K/min; Tstart: -30. C; Tend: 240. C
CapillaryUltra-11454.27Haynes and Pitzer, 198550. m/0.22 mm/0.33 μm, He, 3. K/min; Tstart: -30. C; Tend: 240. C
CapillaryUltra-21453.25Haynes and Pitzer, 198550. m/0.22 mm/0.33 μm, He, 1. K/min; Tstart: -30. C; Tend: 240. C
CapillaryUltra-21453.31Haynes and Pitzer, 198550. m/0.22 mm/0.33 μm, He, 2. K/min; Tstart: -30. C; Tend: 240. C
CapillaryUltra-21453.28Haynes and Pitzer, 198550. m/0.22 mm/0.33 μm, He, 3. K/min; Tstart: -30. C; Tend: 240. C

Van Den Dool and Kratz RI, non-polar column, custom temperature program

View large format table.

Column type Active phase I Reference Comment
CapillaryDB-51454.Zaikin and Borisov, 2002He; Column length: 30. m; Column diameter: 0.25 mm; Program: 30C => 5K/min=120C => 10C/min => 270C

Normal alkane RI, non-polar column, temperature ramp

View large format table.

Column type Active phase I Reference Comment
CapillaryHP-5 MS1454.Kotowska, Zalikowski, et al., 201230. m/0.25 mm/0.25 μm, Helium, 35. C @ 5. min, 3. K/min, 300. C @ 15. min
CapillaryOV-11454.7Krkosova, Kubinec, et al., 2007100. m/0.32 mm/0.25 μm, Helium, 5. K/min, 310. C @ 5. min; Tstart: 30. C

Normal alkane RI, non-polar column, custom temperature program

View large format table.

Column type Active phase I Reference Comment
CapillaryHP-5 MS1454.Kotowska, Zalikowski, et al., 201230. m/0.25 mm/0.25 μm, Helium; Program: not specified
CapillarySqualane1450.Petrov, 1984Program: not specified
CapillaryApiezon L1447.Shlyakhov, 1984Program: not specified

References

Rappoport and Gäumann, 1973
Rappoport, S.; Gäumann, T., 114. L'indice de rétention des alcanes isomères en chromatographie en phase gazeuse, Helv. Chim. Acta, 1973, 56, 3, 1145-1158, https://doi.org/10.1002/hlca.19730560338 . [all data]

Khorasheh, Gray, et al., 1989
Khorasheh, F.; Gray, M.R.; Selucky, M.L., Correlation for Kováts retention index of C9-C26 monoalkyl and polymethyl alkanes and alkenes, J. Chromatogr., 1989, 481, 1-16, https://doi.org/10.1016/S0021-9673(01)96747-0 . [all data]

Haynes and Pitzer, 1985
Haynes, P.C., Jr.; Pitzer, E.W., Disengaging solutes in shale- and petroleum-derived jet fuels by altering GC programmed temperature rates, J. Hi. Res. Chromatogr. Chromatogr. Comm., 1985, 8, 5, 230-242, https://doi.org/10.1002/jhrc.1240080504 . [all data]

Zaikin and Borisov, 2002
Zaikin, V.G.; Borisov, R.S., Chromatographic-mass spectrometric analysis of Fishcer-Tropsch synthesis products, J. Anal. Chem. USSR (Engl. Transl.), 2002, 57, 6, 544-551. [all data]

Kotowska, Zalikowski, et al., 2012
Kotowska, U.; Zalikowski, M.; Isidorov, V.A., HS-SPME/GC-MS analysis of volatile and semi-volatile organic compounds emitted from municipal sewage sludge, Environ. Monit. Asses., 2012, 184, 5, 2893-2907, https://doi.org/10.1007/s10661-011-2158-8 . [all data]

Krkosova, Kubinec, et al., 2007
Krkosova, Z.; Kubinec, R.; Addova, G.; Jurdakova, H.; Blasko, J.; Ostrovsky, I.; Sojak, L., Gas chromatographic - mass spectrometric characterization of monomethylalkanes from fuel diesel, Petroleum Coal, 2007, 49, 3, 51-62. [all data]

Petrov, 1984
Petrov, A.A., Hydrocarbons of petroleum, Nauka (publishing house), Moscow, 1984, 263. [all data]

Shlyakhov, 1984
Shlyakhov, A.F., Gas chromatography in organic geochemistry, Nedra, Moscow, 1984, 221. [all data]