Tetradecanoic acid, 2-hydroxy-

Phase change data

Data compiled by: Thermodynamics Research Center, NIST Boulder Laboratories, Chris Muzny director

Quantity Value Units Method Reference Comment
Tfus353.4KN/ALauer, Gensler, et al., 1941Uncertainty assigned by TRC = 1. K

In addition to the Thermodynamics Research Center (TRC) data available from this site, much more physical and chemical property data is available from the following TRC products:

References

Lauer, Gensler, et al., 1941
Lauer, W.M.; Gensler, W.J.; Miller, E., The Synthesis of 2-Pentadcenoic and 2-Heptadecenoic Acids, J. Am. Chem. Soc., 1941, 63, 1153. [all data]