Silane, 1,2-ethanediylbis[trichloro-

Phase change data

Data compiled by: William E. Acree, Jr., James S. Chickos

Enthalpy of vaporization

ΔvapH (kJ/mol) Temperature (K) Method Reference Comment
48.6379.IJenkins and Chambers, 1954Based on data from 364. - 432. K.

References

Jenkins and Chambers, 1954
Jenkins, Arthur C.; Chambers, George F., Vapor Pressures of Silicon Compounds, Ind. Eng. Chem., 1954, 46, 11, 2367-2369, https://doi.org/10.1021/ie50539a043 . [all data]