Diisopropyldithiocarbamic acid

Gas phase thermochemistry data

Data compiled by: Hussein Y. Afeefy, Joel F. Liebman, and Stephen E. Stein

Quantity Value Units Method Reference Comment
Δfgas-17.9 ± 1.7kJ/molCmRibeiro Da Silva, Reis, et al., 1988

References

Ribeiro Da Silva, Reis, et al., 1988
Ribeiro Da Silva, M.A.V.; Reis, A.M.V.; Pilcher, G., Enthalpies of decomposition of dialkylammoniumdialkyldithiocarbamates (alkyl = ethyl, n-propyl, i-propyl, i-butyl), Thermochim. Acta, 1988, 124, 319-328. [all data]