7,14-Methano-2H,6H-dipyrido[1,2-a:1',2'-e][1,5]diazocine, dodecahydro-, [7S-(7α,7aβ,14α,14aβ)]-

Normal alkane RI, non-polar column, temperature ramp

View large format table.

Column type Active phase I Reference Comment
CapillaryDB-11830.Greinwald, Henrichs, et al., 1995He, 6. K/min; Column length: 30. m; Column diameter: 0.32 mm; Tstart: 150. C; Tend: 300. C
CapillaryDB-11830.van Wyk, Greinwald, et al., 19956. K/min; Column length: 30. m; Column diameter: 0.32 mm; Tstart: 150. C; Tend: 300. C
CapillaryDB-11825.Greinwald, Canto, et al., 1992He, 6. K/min; Column length: 30. m; Column diameter: 0.32 mm; Tstart: 150. C; Tend: 300. C

Normal alkane RI, non-polar column, custom temperature program

View large format table.

Column type Active phase I Reference Comment
CapillaryDB-11830.El-Shazly, Ateya, et al., 2001Helium; Column length: 15. m; Column diameter: 0.317 mm; Program: 150 0C (2 min) 15 0C/min -> 250 0C 25 0C/min -> 300 0C (5 min)
CapillaryDB-11830.Greinwald, Ross, et al., 1996He; Column length: 15. m; Column diameter: 0.25 mm; Program: 150C(2min) => 10C/min => 250C => 20C/min => 300C (10min)
CapillaryDB-11830.Greinwald, Ross, et al., 1995He; Column length: 30. m; Column diameter: 0.32 mm; Program: 150C (2min) => 10C/min => 250C => 20C/min => 300C (5min)
CapillaryDB-11830.Wink, Meissner, et al., 1995Column length: 30. m; Column diameter: 0.3 mm; Program: not specified
CapillaryDB-11830.Greinwald, Witte, et al., 1991He; Column length: 30. m; Column diameter: 0.32 mm; Program: 150C (2min) => 10C/min => 250C => 20C/min => 300C (5min)

References

Greinwald, Henrichs, et al., 1995
Greinwald, R.; Henrichs, C.; Veen, G.; Ross, J.H.; Witte, L.; Czygan, F.-C., A survey of alkaloids in templetonia biloba (Benth.) Polhill (Fabaceae: Brongniartieae), Biochem. Syst. Ecol., 1995, 23, 6, 649-654, https://doi.org/10.1016/0305-1978(95)00035-6 . [all data]

van Wyk, Greinwald, et al., 1995
van Wyk, B.-E.; Greinwald, R.; Witte, L., Alkaloid variation in the Lupinus pusillus group (Fabaceae: tribe Genisteae), Biochem. Syst. Ecol., 1995, 23, 5, 533-537, https://doi.org/10.1016/0305-1978(95)00036-T . [all data]

Greinwald, Canto, et al., 1992
Greinwald, R.; Canto, P.; Bachmann, P.; Witte, L.; Czygan, F.-C., Distribution and taxdonomic significance of alkaloids in the Genista cinerea agregat, Biochem. Syst. Ecol., 1992, 20, 1, 75-81, https://doi.org/10.1016/0305-1978(92)90074-N . [all data]

El-Shazly, Ateya, et al., 2001
El-Shazly, A.; Ateya, A.-M.M.; Wink, M., Quinolizidine alkaloid profiles of lupunus varius orientalis. L. albus albus, L. hartwegii, and L. densiflorus, Z. Naturforsch., 2001, 56c, 21-30. [all data]

Greinwald, Ross, et al., 1996
Greinwald, R.; Ross, J.H.; Witte, L.; Czygan, F.-C., Alkaloids of Templetonia incana, Biochem. Syst. Ecol., 1996, 24, 5, 423-426, https://doi.org/10.1016/0305-1978(96)00024-5 . [all data]

Greinwald, Ross, et al., 1995
Greinwald, R.; Ross, J.H.; Witte, L.; Czygan, F.-C., The alkaloid pattern of Plagiocarpus axillaris (Fabaceae: Brongniartieae), Biochem. Syst. Ecol., 1995, 23, 6, 645-648, https://doi.org/10.1016/0305-1978(95)00059-3 . [all data]

Wink, Meissner, et al., 1995
Wink, M.; Meissner, C.; Witte, L., Patterns of quinolizidine alkaloids in 56 species of the genus Lupinus, Phytochemistry, 1995, 38, 1, 139-153, https://doi.org/10.1016/0031-9422(95)91890-D . [all data]

Greinwald, Witte, et al., 1991
Greinwald, R.; Witte, L.; Wray, V.; Czygan, F.-C., The alkaloid pattern of Cytisophyllum sessilitolium (Fabaceae-Genisteae), Biochem. Syst. Ecol., 1991, 19, 3, 253-258, https://doi.org/10.1016/0305-1978(91)90010-W . [all data]