Ethanone, 2,2-dimethoxy-1,2-diphenyl-

Phase change data

Data compiled as indicated in comments:
TRC - Thermodynamics Research Center, NIST Boulder Laboratories, Chris Muzny director
AC - William E. Acree, Jr., James S. Chickos

Quantity Value Units Method Reference Comment
Tfus338.5KN/ASantilli, DeFilippis, et al., 1994Uncertainty assigned by TRC = 0.8 K; TRC

Enthalpy of fusion

ΔfusH (kJ/mol) Temperature (K) Reference Comment
20.86338.5Santilli, De Filippis, et al., 1994AC

In addition to the Thermodynamics Research Center (TRC) data available from this site, much more physical and chemical property data is available from the following TRC products:

References

Santilli, DeFilippis, et al., 1994
Santilli, N.; DeFilippis, P.; Chianese, A., Solid-liquid phase diagram of the binary system benzil + 2,2-dimethoxy-1,2- diphenylethanone, J. Chem. Eng. Data, 1994, 39, 179-80. [all data]

Santilli, De Filippis, et al., 1994
Santilli, Nazzareno; De Filippis, Paolo; Chianese, Angelo, Solid-liquid phase diagram of the binary system benzil + 2,2-dimethoxy-1,2-diphenylethanone, J. Chem. Eng. Data, 1994, 39, 1, 179-180, https://doi.org/10.1021/je00013a050 . [all data]