Thiazolo[3,2-c]pyrimidin-4-ium, 2,3-dihydro-8-hydroxy-5-methyl-, hydroxide, inner salt

Gas phase ion energetics data

Data compiled by: Sharon G. Lias, John E. Bartmess, Joel F. Liebman, John L. Holmes, Rhoda D. Levin, and W. Gary Mallard

Ionization energy determinations

IE (eV) Method Reference
7.40 ± 0.05PEPedersen and Undheim, 1984

References

Pedersen and Undheim, 1984
Pedersen, A.H.; Undheim, K., N-Quaternary compounds. Part LIX. Facile synthesis of 3-vinyl-4(3H)-pyrimidinethiones, J. Heterocycl. Chem., 1984, 21, 1149. [all data]