1,3,5-Hexatriene, 3-methyl-, (E)-

Gas phase ion energetics data

Data compiled by: Sharon G. Lias, Rhoda D. Levin, and Sherif A. Kafafi

Ionization energy determinations

IE (eV) Method Reference Comment
8.28PEAstrup, Bock, et al., 1975Vertical value

References

Astrup, Bock, et al., 1975
Astrup, E.E.; Bock, H.; Wittel, K.; Heimbach, P., Photoelectron spectra and molecular properties. LIII. Methyl-substituent effects on the hexatriene π system, Acta Chem. Scand. Ser. A:, 1975, 29, 827. [all data]