Cyclopropane, 1,1-dichloro-2,2,3-triethyl-

Phase change data

Data compiled by: Thermodynamics Research Center, NIST Boulder Laboratories, Chris Muzny director

Quantity Value Units Method Reference Comment
Tboil417.KN/ADoering and Hoffman, 1964Uncertainty assigned by TRC = 6. K

In addition to the Thermodynamics Research Center (TRC) data available from this site, much more physical and chemical property data is available from the following TRC products:

References

Doering and Hoffman, 1964
Doering, W. vonE.; Hoffman, A.K., The Addition of Dichlorocarbene to Olefins, J. Am. Chem. Soc., 1964, 76, 6162-5. [all data]