Benzeneacetic acid, 2-chloro-

Phase change data

Data compiled by: William E. Acree, Jr., James S. Chickos

Enthalpy of fusion

ΔfusH (kJ/mol) Temperature (K) Method Reference
24.33367.4DSCRibeiro da Silva, Ferreira, et al., 2008

References

Ribeiro da Silva, Ferreira, et al., 2008
Ribeiro da Silva, Manuel A.V.; Ferreira, Ana I.M.C. Lobo; Lima, Lui´s M. Spencer S.; Sousa, Sandra M.M., Thermochemistry of phenylacetic and monochlorophenylacetic acids, The Journal of Chemical Thermodynamics, 2008, 40, 2, 137-145, https://doi.org/10.1016/j.jct.2007.07.010 . [all data]