Benzoic acid, 2-(1-methylethyl)-

Gas phase thermochemistry data

Data compiled by: Hussein Y. Afeefy, Joel F. Liebman, and Stephen E. Stein

Quantity Value Units Method Reference Comment
Δfgas-359.2 ± 1.9kJ/molCcbColomina, Jimenez, et al., 1987

References

Colomina, Jimenez, et al., 1987
Colomina, M.; Jimenez, P.; Perez-Ossorio, R.; Roux, M.V.; Turrion, C., Thermochemical properties of benzoic acid derivatives. XIV. Enthalpies of combustion, vapour pressures, enthalpies of sublimation, and enthalpies of formation of o-, m-, and p-isopropylbenzoic acids, J. Chem. Thermodyn., 1987, 19, 155-162. [all data]