Tricosanoic acid, methyl ester

Phase change data

Data compiled by: William E. Acree, Jr., James S. Chickos

Enthalpy of vaporization

ΔvapH (kJ/mol) Temperature (K) Method Reference Comment
99.8488.A,ESTStephenson and Malanowski, 1987Based on data from 473. - 528. K. See also Rose and Schrodt, 1963.

References

Stephenson and Malanowski, 1987
Stephenson, Richard M.; Malanowski, Stanislaw, Handbook of the Thermodynamics of Organic Compounds, 1987, https://doi.org/10.1007/978-94-009-3173-2 . [all data]

Rose and Schrodt, 1963
Rose, Arthur; Schrodt, Verle N., Correlation and Prediction of Vapor Pressures of Homologs. Use of Structure Parameters and Gas Chromatography Data., J. Chem. Eng. Data, 1963, 8, 1, 9-13, https://doi.org/10.1021/je60016a002 . [all data]