Formamide, N-(1,1-dimethylethyl)-

Phase change data

Data compiled by: Robert L. Brown and Stephen E. Stein

Quantity Value Units Method Reference Comment
Tboil475.2KN/AAldrich Chemical Company Inc., 1990
Tboil475.KN/AAmerican Tokyo Kasei, 1988

Reduced pressure boiling point

Tboil (K) Pressure (bar) Reference
376. - 377.0.033Frinton Laboratories Inc., 1986

Kovats' RI, non-polar column, isothermal

Data compiled by: NIST Mass Spectrometry Data Center, William E. Wallace, director

Column type Packed
Active phase SE-30
Column length (m) 1.
Carrier gas N2
Substrate Chromosorb W AW
Column diameter (mm)
Phase thickness (μm)
Temperature (C) 180.
I 915.
ReferenceKrawczyk and Piotrowski, 1989
Comment MSDC-RI

References

Aldrich Chemical Company Inc., 1990
Aldrich Chemical Company Inc., Catalog Handbook of Fine Chemicals, Aldrich Chemical Company, Inc., Milwaukee WI, 1990, 1. [all data]

American Tokyo Kasei, 1988
American Tokyo Kasei, TCI American Organic Chemical 88/89 Catalog, American Tokyo Kasei, Portland, OR, 1988, 1610. [all data]

Frinton Laboratories Inc., 1986
Frinton Laboratories Inc., Catalog Number 11, Frinton Laboratories Inc., Vineland, NJ, 1986, 99. [all data]