1,4,8,11-Tetrathiacyclotetradecane

Phase change data

Data compiled by: William E. Acree, Jr., James S. Chickos

Enthalpy of fusion

ΔfusH (kcal/mol) Temperature (K) Method Reference
7.89393.2DSCRockwell, Grindley, et al., 2002

References

Rockwell, Grindley, et al., 2002
Rockwell, Glen D.; Grindley, T. Bruce; Smith, K. Christopher; White, Mary Anne, Melting Behavior of Crown Thioethers: Correlation of Entropy Changes with Conformational Disorder, J. Phys. Chem. B, 2002, 106, 47, 12311-12316, https://doi.org/10.1021/jp025812r . [all data]