Thiazolidine, 2-ethyl-

Normal alkane RI, non-polar column, temperature ramp

Data compiled by: NIST Mass Spectrometry Data Center, William E. Wallace, director

Column type CapillaryCapillary
Active phase SPB-1DB-5
Column length (m) 60.60.
Carrier gas HeHe
Substrate
Column diameter (mm) 0.320.25
Phase thickness (μm) 0.25
Tstart (C) 70.40.
Tend (C) 180.160.
Heat rate (K/min) 4.2.
Initial hold (min)  5.
Final hold (min)
I 983.1034.
ReferenceHuang, Huang, et al., 1998Macku and Shibamoto, 1991
Comment MSDC-RI MSDC-RI

References

Huang, Huang, et al., 1998
Huang, T.-C.; Huang, L.-Z.; Ho, C.-T., Mechanistic studies on thiazolidine formation in aldehyde/cysteamine model systems, J. Agric. Food Chem., 1998, 46, 1, 224-227, https://doi.org/10.1021/jf9705633 . [all data]

Macku and Shibamoto, 1991
Macku, C.; Shibamoto, T., Volatile sulfur-containing compounds generated from the thermal interaction of corn oil and cysteine, J. Agric. Food Chem., 1991, 39, 11, 1987-1989, https://doi.org/10.1021/jf00011a021 . [all data]