Spiro[4.5]dec-7-ene, 1,8-dimethyl-4-(1-methylethenyl)-, [1S-(1α,4β,5α)]-

Normal alkane RI, non-polar column, custom temperature program

Data compiled by: NIST Mass Spectrometry Data Center, William E. Wallace, director

Column type CapillaryCapillaryCapillaryCapillaryCapillary
Active phase VF-5VF-5HP-5MSHP-5MSCP Sil 8 CB
Column length (m) 30.30.30.30.50.
Carrier gas HeliumHeliumHeHeHe
Substrate
Column diameter (mm) 0.250.250.250.250.32
Phase thickness (μm) 0.250.250.250.250.25
Program 50 0C (2 min) 3 0C/min -> 200 0C (3 min) 10 0C/min -> 220 0C (8 min)not specified40C (2min) => 10C/min => 200C => 15C/min => 250C (5min)40C (2min) => 10C/min => 200C => 15C/min => 250C (5min)60C(2min) => 5C/min => 160C(1min) => 10C/min => 250C (5min)
I 1479.1471.1483.1483.1464.
ReferenceShivashankar, Roy, et al., 2012Shivashankar, Roy, et al., 2012Demyttenaere, Moriña, et al., 2004Demyttenaere, Moriña, et al., 2004Judpentienë and Mockutë, 2004
Comment MSDC-RI MSDC-RI MSDC-RI MSDC-RI MSDC-RI
Column type CapillaryCapillary
Active phase DB-5DB-5
Column length (m) 30.30.
Carrier gas
Substrate
Column diameter (mm) 0.250.25
Phase thickness (μm) 0.250.25
Program 35C(1min) => 5C/min => 230C => 20C/min => 280C35C(1min) => 5C/min => 230C => 20C/min => 280C
I 1476.1474.
ReferenceJelen H.H., Mirocha C.J., et al., 1995Jelen H.H., Mirocha C.J., et al., 1995
Comment MSDC-RI MSDC-RI

Normal alkane RI, non-polar column, temperature ramp

Data compiled by: NIST Mass Spectrometry Data Center, William E. Wallace, director

Column type CapillaryCapillaryCapillaryCapillary
Active phase VF-1 MSDB-5DB-5HP-5MS
Column length (m) 30.50.30.30.
Carrier gas Helium H2He
Substrate
Column diameter (mm) 0.250.30.250.25
Phase thickness (μm) 0.250.250.250.25
Tstart (C) 60.60.50.50.
Tend (C) 280.240.290.230.
Heat rate (K/min) 4.2.4.5.
Initial hold (min) 5.  2.
Final hold (min) 10.  10.
I 1474.1421.1471.1459.
ReferenceMarchesini, Prada, et al., 2009Chagonda and Chalchat, 2005Abreu, Reis, et al., 2004Li and Jiang, 2004
Comment MSDC-RI MSDC-RI MSDC-RI MSDC-RI

References

Shivashankar, Roy, et al., 2012
Shivashankar, S.; Roy, T.K.; Moorthy, P.N.R., Headspace solid phase micro extraction and GC/MS analysis of the volatile components in seed and cake of Azadirachta indica A. juss, Chem. Bull. of Politechnika Univ. Timisoara, Romania, 2012, 57(71), 1, 1-6. [all data]

Demyttenaere, Moriña, et al., 2004
Demyttenaere, J.C.R.; Moriña, R.M.; De Kimpe, N.; Sandra, P., Use of headspace solid-phase microextraction and headspace sorptive extraction for the detection of the volatile metabolites produced by toxigenic Fusarium species, J. Chromatogr. A, 2004, 1027, 1-2, 147-154, https://doi.org/10.1016/j.chroma.2003.08.105 . [all data]

Judpentienë and Mockutë, 2004
Judpentienë, A.; Mockutë, D., Chemical composition of essential oils of Artemisia absinthium L. (wormwood) growing wild in Vilnius, Chemija, 2004, 15, 4, 64-68. [all data]

Jelen H.H., Mirocha C.J., et al., 1995
Jelen H.H.; Mirocha C.J.; Wasowicz E.; Kaminski E., Production of volatile sesquiterpenes by Fusarium sambucinum strans with different abilities to synthesize trichlothecenes, Appl. Environ. Microbiol., 1995, 61, 11, 3815-3820. [all data]