N,N-Dibenzoylmethylamine

Phase change data

Data compiled by: William E. Acree, Jr., James S. Chickos

Quantity Value Units Method Reference Comment
Δsub28.70 ± 0.1kcal/molN/ARoux, Jimenez, et al., 1997

Enthalpy of sublimation

ΔsubH (kcal/mol) Temperature (K) Method Reference Comment
27.92 ± 0.1356.MERoux, Jimenez, et al., 1997Based on data from 246. - 269. K.

References

Roux, Jimenez, et al., 1997
Roux, M.V.; Jimenez, P.; Martin-Luengo, M.A.; Davalos, J.Z.; Sun, Z.; Hosmane, R.S.; Liebman, J.F., The elusive antiaromaticity of Maleimides and maleic anhydride: Enthalpies of formation of N-methylmaleimide, N-methylsuccinimide, N-Methylphtalimide, and N-benzoyl-N-methylbenzamide, J. Org. Chem., 1997, 62, 2732-2737. [all data]