6-chloro-2-(6-chloro-4-methyl-3-oxobenzo[b]thien-2(3H)-ylidene)-4-methylbenzo[b]thiophene-3(2H)-one

Phase change data

Data compiled by: William E. Acree, Jr., James S. Chickos

Enthalpy of sublimation

ΔsubH (kJ/mol) Temperature (K) Method Reference Comment
148.577.GSNishida, Ando, et al., 2008Based on data from 519. - 634. K.

References

Nishida, Ando, et al., 2008
Nishida, K.; Ando, Y.; Sunagawa, S.; Ogihara, A.; Tanaka, I.; Koukitsu, A., Vapour Pressures and Heats of Sublimation of Some Vat Dyes, J Food Science, 2008, 102, 1, 18-20, https://doi.org/10.1111/j.1478-4408.1986.tb01039.x . [all data]