L-Phenylalanine, N-(trifluoroacetyl)-, methyl ester

Kovats' RI, non-polar column, isothermal

Data compiled by: NIST Mass Spectrometry Data Center, William E. Wallace, director

Column type PackedPackedPacked
Active phase OV-1OV-1OV-1
Column length (m) 2.2.2.
Carrier gas N2N2N2
Substrate Gas Chrom QGas Chrom QGas Chrom Q
Column diameter (mm)
Phase thickness (μm)
Temperature (C) 140.150.160.
I 1446.1455.1462.
ReferenceTomori, Kalasz, et al., 1974Tomori, Kalasz, et al., 1974Tomori, Kalasz, et al., 1974
Comment MSDC-RI MSDC-RI MSDC-RI

Van Den Dool and Kratz RI, non-polar column, custom temperature program

Data compiled by: NIST Mass Spectrometry Data Center, William E. Wallace, director

Column type Packed
Active phase OV-1
Column length (m) 2.
Carrier gas N2
Substrate Gas Chrom Q
Column diameter (mm)
Phase thickness (μm)
Program not specified
I 1442.
ReferenceTomori, Kalasz, et al., 1974
Comment MSDC-RI

References

Tomori, Kalasz, et al., 1974
Tomori, E.; Kalasz, H.; Nagy, J.; Knoll, J., Gas Chromatographic Studies of Derivatives of Celluline-Like Substances, J. Chromatogr., 1974, 91, 113-118, https://doi.org/10.1016/S0021-9673(01)97890-2 . [all data]