2-Cyclohexen-1-one, 3,6,6-trimethyl-

Van Den Dool and Kratz RI, non-polar column, temperature ramp

View large format table.

Column type Active phase I Reference Comment
CapillaryHP-51137.Xian Q., Chen H., et al., 200630. m/0.25 mm/0.25 μm, He, 3. K/min, 220. C @ 20. min; Tstart: 50. C

Normal alkane RI, non-polar column, custom temperature program

View large format table.

Column type Active phase I Reference Comment
CapillaryDB-51166.Isidorov, Zenkevich, et al., 1997Program: not specified

References

Xian Q., Chen H., et al., 2006
Xian Q.; Chen H.; Zou H.; Yin D., Chemical composition of essential oils of two submerged macrophytes, Ceratophyllum demersum L. and Vallisneria spiralis L., Flavour Fragr. J., 2006, 21, 3, 524-526, https://doi.org/10.1002/ffj.1588 . [all data]

Isidorov, Zenkevich, et al., 1997
Isidorov, V.; Zenkevich, I.; Sacharevich, T., Calculation of Gas Chromatographic Retention Indices for Monoterpenes and Terpenoids from Their Physico-Chemical Constants, Chem. Anal. (Warsaw), 1997, 42, 627-634. [all data]