Pentanamine, n-pentyl-, hydrochloride

Phase change data

Data compiled by: Eugene S. Domalski and Elizabeth D. Hearing

Enthalpy of phase transition

ΔHtrs (kJ/mol) Temperature (K) Initial Phase Final Phase Reference Comment
1.3125243.84crystaline, IIcrystaline, IVan Oort and White, 1988

Entropy of phase transition

ΔStrs (J/mol*K) Temperature (K) Initial Phase Final Phase Reference Comment
5.38243.84crystaline, IIcrystaline, IVan Oort and White, 1988

References

Van Oort and White, 1988
Van Oort, M.J.M.; White, M.A., Polymorphism in dialkylammonium chlorides. An adiabatic calorimetry study, Ber. Bunsenges. Phys. Chem., 1988, 92, 168-176. [all data]