Propanoic acid, 2,2-dimethyl-, pentyl ester

Kovats' RI, non-polar column, isothermal

View large format table.

Column type Active phase Temperature (C) I Reference Comment
PackedSE-30100.1062.Chastrette, Heintz, et al., 1974N2, Chromosorb W AW (60-80 mesh); Column length: 3. m

Kovats' RI, polar column, isothermal

View large format table.

Column type Active phase Temperature (C) I Reference Comment
PackedCarbowax 20M100.1227.Chastrette, Heintz, et al., 1974Chromosorb WAW (60-80 mesh); Column length: 3. m

Normal alkane RI, non-polar column, custom temperature program

View large format table.

Column type Active phase I Reference Comment
CapillarySE-301063.Vinogradov, 2004Program: not specified

Normal alkane RI, polar column, custom temperature program

View large format table.

Column type Active phase I Reference Comment
CapillaryCarbowax 20M1228.Vinogradov, 2004Program: not specified

References

Chastrette, Heintz, et al., 1974
Chastrette, M.; Heintz, M.; Druilhe, A.; Lefort, D., Analyse chromatographique d'esters aliphatiques saturés. Relations rétention-structure et prévision de la rétention, Bull. Soc. Chim. Fr., 1974, 9/10,Pt.1, 1852-1856. [all data]

Vinogradov, 2004
Vinogradov, B.A., Production, composition, properties and application of essential oils, 2004, retrieved from http://viness.narod.ru. [all data]