2-Hexanol, 3-methyl-

Phase change data

Data compiled by: Thermodynamics Research Center, NIST Boulder Laboratories, Chris Muzny director

Quantity Value Units Method Reference Comment
Tboil424.65KN/AMontagne, 1930Uncertainty assigned by TRC = 3. K

In addition to the Thermodynamics Research Center (TRC) data available from this site, much more physical and chemical property data is available from the following TRC products:

References

Montagne, 1930
Montagne, M., Ann. Chim. (Paris), 1930, 13, 40. [all data]