4-Methyl-2-hexanol

Phase change data

Data compiled by: Thermodynamics Research Center, NIST Boulder Laboratories, Chris Muzny director

Quantity Value Units Method Reference Comment
Tboil421.15KN/AWoo, Dion, et al., 1961Uncertainty assigned by TRC = 3. K
Tboil425.15KN/AEvans and Huston, 1959Uncertainty assigned by TRC = 2. K
Tboil423.65KN/AGordon and Burwell, 1949Uncertainty assigned by TRC = 1.5 K; identified as unknown ratio of diastereoisomers of (+)4-methyl-2-hexanol

In addition to the Thermodynamics Research Center (TRC) data available from this site, much more physical and chemical property data is available from the following TRC products:

References

Woo, Dion, et al., 1961
Woo; Dion; Bartz, J. Am. Chem. Soc., 1961, 83, 3085. [all data]

Evans and Huston, 1959
Evans, F.E.; Huston, R.C., J. Org. Chem., 1959, 24, 1178. [all data]

Gordon and Burwell, 1949
Gordon, G.S.; Burwell, R.L., The acton of sulfuric acid, ethanesulfonic acid and chlorosulfonic acid on aliphatic hydrocarbons, J. Am. Chem. Soc., 1949, 71, 2355. [all data]