2,5-Piperazinedione, 3,6-bis(phenylmethyl)-

Condensed phase thermochemistry data

Data compiled by: Hussein Y. Afeefy, Joel F. Liebman, and Stephen E. Stein

Quantity Value Units Method Reference Comment
Δcsolid-9368.02 ± 0.92kJ/molCcbPonomarev, Alekseeva, et al., 1963

References

Ponomarev, Alekseeva, et al., 1963
Ponomarev, V.V.; Alekseeva, T.A.; Akimova, L.N., Heats of combustion of valylphenylalanine, phenylalanylanhydride, and glycylvalylanhydride, Russ. J. Phys. Chem. (Engl. Transl.), 1963, 37, 117-118. [all data]