N-methyl-N-(4-methylsulfonylphenyl)nitramine

Phase change data

Data compiled by: William E. Acree, Jr., James S. Chickos

Enthalpy of fusion

ΔfusH (kJ/mol) Temperature (K) Reference
19.2438.1Daszkiewicz, Zaleski, et al., 2002

References

Daszkiewicz, Zaleski, et al., 2002
Daszkiewicz, Z.; Zaleski, J.; Nowakowska, E.M.; Kyziol, J.B., Pol. J. Chem., 2002, 76, 8, 1113. [all data]