Silane, 1,3-propanediylbis[trimethyl-

Phase change data

Data compiled as indicated in comments:
TRC - Thermodynamics Research Center, NIST Boulder Laboratories, Chris Muzny director
DH - Eugene S. Domalski and Elizabeth D. Hearing
AC - William E. Acree, Jr., James S. Chickos

Quantity Value Units Method Reference Comment
Ttriple223.73KN/AGuseinov, Karasharli, et al., 1975Uncertainty assigned by TRC = 0.05 K; TRC

Enthalpy of vaporization

ΔvapH (kcal/mol) Temperature (K) Method Reference Comment
10.300444.52N/AGuseinov, Karasharli, et al., 1975, 2DH
10.3 ± 0.1390.QMGuseinov, Kuliev, et al., 1975Based on data from 338. - 443. K. See also Guseinov, Karasharli, et al., 1975.; AC

Entropy of vaporization

ΔvapS (cal/mol*K) Temperature (K) Reference Comment
23.18444.52Guseinov, Karasharli, et al., 1975, 2DH

Enthalpy of fusion

ΔfusH (kcal/mol) Temperature (K) Reference Comment
3.8380223.73Guseinov, Karasharli, et al., 1975, 2DH
3.836223.7Domalski and Hearing, 1996See also Guseinov, Karasharli, et al., 1975.; AC

Entropy of fusion

ΔfusS (cal/mol*K) Temperature (K) Reference Comment
17.15223.73Guseinov, Karasharli, et al., 1975, 2DH

In addition to the Thermodynamics Research Center (TRC) data available from this site, much more physical and chemical property data is available from the following TRC products:

Gas phase ion energetics data

Data compiled by: Sharon G. Lias, Rhoda D. Levin, and Sherif A. Kafafi

Ionization energy determinations

IE (eV) Method Reference Comment
9.41PEHosomi and Traylor, 1975Vertical value

References

Guseinov, Karasharli, et al., 1975
Guseinov, A.Z.; Karasharli, K.A.; Dzhafarov, O.I.; Nurullaev, G.G.; Nametkin, N.S.; Gusel'nikov, L.E.; Volnina, E.A.; Burdasov, E.N.; Vdovin, V.N., Dokl. Akad. Nauk SSSR, 1975, 222, 1369. [all data]

Guseinov, Karasharli, et al., 1975, 2
Guseinov, Z.A.; Karasharli, K.A.; Dzhafarov, O.I.; Nurullaev, G.G.; Nametkin, N.S.; Gusel'nikov, L.E.; Volnina, F.A.; Burdasov, E.N.; Vdovin, V.M., Thermodynamic parameters of some cyclic and bridging carbosilanes, Dokl.Akad. Nauk, 1975, SSSR 222, 1369-1372. [all data]

Guseinov, Kuliev, et al., 1975
Guseinov, A.Z.; Kuliev, A.A.; Karasharli, K.A.; Dzhafarov, O.I., Azerb. Khim. Zh., 1975, 72. [all data]

Domalski and Hearing, 1996
Domalski, Eugene S.; Hearing, Elizabeth D., Heat Capacities and Entropies of Organic Compounds in the Condensed Phase. Volume III, J. Phys. Chem. Ref. Data, 1996, 25, 1, 1, https://doi.org/10.1063/1.555985 . [all data]