p-dihexylbenzene

Phase change data

Data compiled by: Thermodynamics Research Center, NIST Boulder Laboratories, Chris Muzny director

Quantity Value Units Method Reference Comment
Tfus224.KN/APetrov, Nikishin, et al., 1960Uncertainty assigned by TRC = 6. K

In addition to the Thermodynamics Research Center (TRC) data available from this site, much more physical and chemical property data is available from the following TRC products:

References

Petrov, Nikishin, et al., 1960
Petrov, A.D.; Nikishin, G.I.; Vorobev, V.D., Izv. Akad. Nauk SSSR, 1960, 1960, 717-23. [all data]