(S)-2,2,6-Trimethyl-6-((S)-4-methylcyclohex-3-en-1-yl)dihydro-2H-pyran-3(4H)-one

Normal alkane RI, polar column, temperature ramp

Data compiled by: NIST Mass Spectrometry Data Center, William E. Wallace, director

Column type CapillaryCapillary
Active phase SW-10PEG-20M
Column length (m) 50.50.
Carrier gas HeHe
Substrate
Column diameter (mm) 0.200.2
Phase thickness (μm) 0.25
Tstart (C) 50.70.
Tend (C) 250.250.
Heat rate (K/min) 2.2.
Initial hold (min)
Final hold (min)
I 2158.2158.
ReferenceRaal, Arak, et al., 2003Orav, Kailas, et al., 2001
Comment MSDC-RI MSDC-RI

References

Raal, Arak, et al., 2003
Raal, A.; Arak, E.; Orav, A.; Ivask, K., Comparison of essential oil content of Matricaria recutita L. from different origins, Ars Pharm., 2003, 44, 2, 159-165, retrieved from http://www.ugr.es/~ars/abstract/44-159-03.pdf. [all data]

Orav, Kailas, et al., 2001
Orav, A.; Kailas, T.; Ivask, K., Volatile constituents of Matricaria recutita L. from Estonia, Proc. Est. Acad. Sci. Chem., 2001, 50, 39-45. [all data]