Benzo(a)acridine

Gas phase ion energetics data

Data compiled by: Henry M. Rosenstock, Keith Draxl, Bruce W. Steiner, and John T. Herron

Ionization energy determinations

IE (eV) Method Reference
8.1 ± 0.1CTSFarrell and Newton, 1966

Lee's RI, non-polar column, temperature ramp

View large format table.

Column type Active phase I Reference Comment
CapillarySE-52397.83Hasegawa, Usami, et al., 19902. K/min; Column length: 12. m; Column diameter: 0.25 mm; Tstart: 50. C; Tend: 270. C
CapillarySE-52398.65Vassilaros, Kong, et al., 198220. m/0.30 mm/0.25 μm, H2, 40. C @ 2. min, 4. K/min; Tend: 265. C
CapillarySE-52398.74Lee, Vassilaros, et al., 197912. m/0.3 mm/0.34 μm, He, 2. K/min; Tstart: 50. C; Tend: 250. C

Lee's RI, non-polar column, custom temperature program

View large format table.

Column type Active phase I Reference Comment
CapillarySE-52398.65Hasegawa, Usami, et al., 1990Column length: 12. m; Column diameter: 0.25 mm; Program: not specified

References

Farrell and Newton, 1966
Farrell, P.G.; Newton, J., Ionization potentials of primary aromatic amines and aza-hydrocarbons, Tetrahedron Lett., 1966, 5517. [all data]