2,3-Diazabicyclo[2.2.1]hept-2-ene,2-oxide

Gas phase ion energetics data

Data compiled as indicated in comments:
LLK - Sharon G. Lias, Rhoda D. Levin, and Sherif A. Kafafi

Ionization energy determinations

IE (eV) Method Reference Comment
9.2PEBunzli, Olsen, et al., 1977LLK
9.48 ± 0.03PEBunzli, Olsen, et al., 1977Vertical value; LLK

References

Bunzli, Olsen, et al., 1977
Bunzli, J.-C.G.; Olsen, H.; Snyder, J.P., Photoelectron spectra of bicyclic azo N-oxides and azo N, N'-dioxides, J. Org. Chem., 1977, 42, 614. [all data]