1,4-Dithiin, 2,5-bis(4-chlorophenyl)-

Lee's RI, non-polar column, temperature ramp

View large format table.

Column type Active phase I Reference Comment
CapillaryDB-5360.9Viau, Studak, et al., 1984Helium, 4. K/min; Column length: 30. m; Column diameter: 0.32 mm; Tstart: 90. C; Tend: 250. C

References

Viau, Studak, et al., 1984
Viau, A.C.; Studak, S.M.; Karasek, F.W., Comparative analysis of hazardous compounds on flu-ash from municipal waste incineration by gas chromatography / mass spectrometry, Can. J. Chem., 1984, 62, 11, 2140-2145, https://doi.org/10.1139/v84-366 . [all data]