Undecanenitrile

Condensed phase thermochemistry data

Data compiled by: Hussein Y. Afeefy, Joel F. Liebman, and Stephen E. Stein

Quantity Value Units Method Reference Comment
Δfliquid-184.5 ± 2.0kJ/molCcrStridh, Sunner, et al., 1977
Quantity Value Units Method Reference Comment
Δcliquid-7145.3 ± 1.3kJ/molCcrStridh, Sunner, et al., 1977

Lee's RI, non-polar column, temperature ramp

View large format table.

Column type Active phase I Reference Comment
CapillaryDB-5237.44Rostad and Pereira, 198630. m/0.26 mm/0.25 μm, He, 50. C @ 4. min, 6. K/min, 300. C @ 20. min

References

Stridh, Sunner, et al., 1977
Stridh, G.; Sunner, S.; Svensson, C., Enthalpies of combustion, vaporization, and formation of some alkanenitriles, and the CH2-increment in the alkanenitrile series, J. Chem. Thermodyn., 1977, 9, 1005-1010. [all data]