Butanamide, N,N-diethyl-3-oxo-

Reaction thermochemistry data

Data compiled by: Hussein Y. Afeefy, Joel F. Liebman, and Stephen E. Stein

Individual Reactions

Butanamide, N,N-diethyl-3-oxo- = 2-Butenamide, N,N-diethyl-3-hydroxy-, (Z)-

By formula: C8H15NO2 = C8H15NO2

Quantity Value Units Method Reference Comment
Δr-6.95kJ/molEqkHammaker and Gugler, 1965liquid phase

References

Hammaker and Gugler, 1965
Hammaker, R.M.; Gugler, B.A., An NMR study of hindered internal rotation in N,N-dialkyl amides, J. Mol. Spectrosc., 1965, 17, 356-364. [all data]