Acridine, 9-stryl-, (E)-

Reaction thermochemistry data

Data compiled by: Hussein Y. Afeefy, Joel F. Liebman, and Stephen E. Stein

Individual Reactions

(Z) 9-Styrylacridine = Acridine, 9-stryl-, (E)-

By formula: C21H15N = C21H15N

Quantity Value Units Method Reference Comment
Δr-1.2 ± 0.1kcal/molCmBastianelli, Caia, et al., 1991liquid phase; Thermal isomerization

References

Bastianelli, Caia, et al., 1991
Bastianelli, C.; Caia, V.; Cum, G.; Gallo, R.; Mancini, V., Thermal isomerization of photochemically synthesized (Z)-9-styrylacridines. An unusually high enthalpy of Z->E conversion for stilbene-like compounds, J. Chem. Soc. Perkin Trans. 2, 1991, 679-683. [all data]