2,3,4-Trimethylpyridine

Kovats' RI, non-polar column, isothermal

View large format table.

Column type Active phase Temperature (C) I Reference Comment
CapillaryOV-101110.1084.Zhuravleva, Terenina, et al., 199040. m/0.27 mm/0.4 μm
PackedApiezon L130.1099.Shatts, Avots, et al., 1977He, Chromosorb W AW-DMCS; Column length: 2.4 m

Kovats' RI, polar column, isothermal

View large format table.

Column type Active phase Temperature (C) I Reference Comment
CapillaryPEG-40M110.1541.Zhuravleva, Terenina, et al., 199040. m/0.22 mm/0.40 μm

References

Zhuravleva, Terenina, et al., 1990
Zhuravleva, I.L.; Terenina, M.B.; Shenderyuk, V.V.; Golovnya, R.V., Capillary chromatography. Calculation of retention indices of alkylpyridines on the basis of non-equal energy contributions of identical alkyl groups, Zh. Anal. Khim., 1990, 45, 722-729. [all data]

Shatts, Avots, et al., 1977
Shatts, V.D.; Avots, A.A.; Belikov, V.A., Retention indices of alkylpyridines, Zh. Anal. Khim., 1977, 32, 4, 631-638. [all data]