1-cyclopentylicosane

Kovats' RI, non-polar column, isothermal

View large format table.

Column type Active phase Temperature (C) I Reference Comment
CapillaryDB-1200.2568.68Stransky and Valterova, 199830. m/0.25 mm/0.25 μm, H2
CapillaryDexsil 300220.2590.Szafranek, Kusmierz, et al., 1982He; Column length: 30. m; Column diameter: 0.30 mm

Kovats' RI, polar column, isothermal

View large format table.

Column type Active phase Temperature (C) I Reference Comment
CapillaryDB-Wax200.2647.71Stransky and Valterova, 199830. m/0.25 mm/0.25 μm, H2

References

Stransky and Valterova, 1998
Stransky, K.; Valterova, I., Gas chromatography and mass spectrometry of isomeric cyclohexylnonadecanes and 1-cyclopentylicosane, Collect. Czech. Chem. Commun., 1998, 63, 10, 1513-1521, https://doi.org/10.1135/cccc19981513 . [all data]

Szafranek, Kusmierz, et al., 1982
Szafranek, J.; Kusmierz, J.; Czerwiec, W., Gas chromatographic-mass spectrometric investigations of high-boiling crude oil alkane fractions, J. Chromatogr., 1982, 245, 2, 219-228, https://doi.org/10.1016/S0021-9673(00)88591-X . [all data]