Fenamiphos

Normal alkane RI, non-polar column, custom temperature program

Data compiled by: NIST Mass Spectrometry Data Center, William E. Wallace, director

Column type CapillaryCapillary
Active phase 5 % Phenyl methyl siloxane5 % Phenyl methyl siloxane
Column length (m) 30.30.
Carrier gas HeliumHelium
Substrate
Column diameter (mm) 0.250.25
Phase thickness (μm) 0.250.25
Program 50 0C(1 min) 25 0C/min -> 125 0C 10 0C/min -> 300 0C (10 min)50 0C(1 min) 25 0C/min -> 125 0C 10 0C/min -> 300 0C (10 min)
I 2154.2152.
ReferenceDepartment of Food Safety and Welfare, 2006Department of Food Safety and Welfare, 2006
Comment MSDC-RI MSDC-RI

References

Department of Food Safety and Welfare, 2006
Department of Food Safety, Ministry of Health; Welfare, Analytical methods for residual compositional substances of agricultural chemicals, feed aadditives, and veterinary drugs in foods, 2006, retrieved from http://www.mhlw.go.jp/english/topics/foodsafety/positivelist060228/de/060526-1a.pdf. [all data]